{"text_format":"1","workbook":"xlsx","n_sheets":16,"sheets":["Instruktioner","0. Sekretesselever","1. Redovisning av elever","2. Kontroll personnr kurskod","3. Kontroll begränsning kurser","4. Anpassad utbildning","5. Övriga uppgifter","6. Sammanställning redovisning","Sammanställning ansökan","7. EU-medel","Kurslista","Dubblettkontroll","Kontrollog","Särskilda skäl","kurslista låst","parametrar"],"not_rendered":{"charts":0,"images":5,"macros":1,"external_links":1,"defined_names":28,"comments":0,"pivot_tables":0},"unopened":[],"bounds":{"document_bytes":16777216,"sheet_cells":100000,"rows_first":2000,"rows_last":500,"rows_between":2000,"halvings":0,"cell_chars":16384,"cell_head_chars":4096},"cells_cut":0,"cells_raw":0,"read":"whole","date_system":"1900"}

{"sheet":"Instruktioner","index":0,"n_rows":92,"n_cols":8,"rows_kept":92,"cut":false,"hidden":false,"merged":[[87,1,88,12],[91,1,92,12],[66,1,66,12],[68,0,68,13],[70,1,70,12],[71,1,71,12],[73,1,73,12],[75,0,75,13],[76,0,76,13],[77,0,78,13],[81,1,81,12],[83,1,85,12],[56,1,56,12],[58,0,58,13],[60,1,60,12],[62,0,62,13],[65,1,65,12],[64,1,64,12],[46,0,46,13],[48,1,48,12],[50,0,50,13],[52,1,52,12],[54,0,54,13],[34,4,34,12],[36,4,36,12],[38,4,38,12],[42,0,42,13],[44,1,44,12],[10,1,11,12],[20,0,21,13],[23,1,23,3],[23,4,23,12],[30,4,30,12],[0,0,1,13],[3,1,3,12],[5,7,5,11],[6,7,6,10],[8,1,8,12]]}
["Redovisning Lärlingsvux kombination 2023"]
[]
[]
[null,"Skicka in redovisningsblanketten i e-tjänsten senast 15 februari 2024. "]
[]
[null,"För frågor om Skolverkets e-tjänst, kontakta:",null,null,null,null,null,"https://www.skolverket.se/om-oss/kontakta-oss"]
[null,"För frågor om redovisningen eller blanketten, kontakta:",null,null,null,null,null,"statsbidragvux@skolverket.se "]
[]
[]
[]
[null,"Kom ihåg att klicka på \"Data\" och sedan \"Uppdatera alla\" i menyn högst upp (eller den röda knappen nedan) efter att ni har lagt in uppgifter i flik 0 Sekretesselever, flik 1 Redovisning av elever och flik 4 Särskild utbildning. "]
[]
[]
[]
[]
{"$rows_left_out":78}
{"sheet":"0. Sekretesselever","index":1,"n_rows":1018,"n_cols":14,"rows_kept":1018,"cut":false,"hidden":false,"merged":[[25,4,25,15],[26,4,32,15],[16,4,16,6],[16,7,16,9],[16,10,16,12],[16,13,16,15],[18,4,20,9],[18,10,20,15],[12,4,13,6],[12,7,13,9],[12,10,13,12],[12,13,13,15],[14,4,14,6],[14,7,14,9],[14,10,14,12],[14,13,14,15],[10,4,11,6],[10,7,11,9],[10,10,11,12],[10,13,11,15],[6,4,7,15],[8,4,9,6],[8,7,9,9],[8,10,9,12],[8,13,9,15]]}
["Kursnamn","Kurskod","Lästa verksamhetspoäng per kurskod"]
["Administration – specialisering","ADMADM00S"]
["Administration 1","ADMADM01"]
["Administration 2","ADMADM02"]
["Administration av nätverks- och serverutrustning","NAIADM0",null,null,"Summering av redovisat statsbidrag visas nedan när du tryckt på Uppdatera alla under Data i menyn ovan"]
["Administration av nätverks- och serverutrustning","NÄVADM0"]
["Aerodynamik","FLYAER0",null,null,"Summering sekretesselever"]
["Aerodynamik","YRKAER0"]
["Affärsjuridik","JURAFF0",null,null,"Typ av kurs (ersättningsnivå)",null,null,"Totalt lästa verksamhetspoäng",null,null,"Antal årsstudieplatser",null,null,"Statsbidrag"]
["Affärskommunikation","AFFAFÄ00S"]
["Affärsutveckling och ledarskap","HANAFR0",null,null,30000,null,null,{"$f":"SUM(Tabell12[Lästa verksamhetspoäng per kurskod])","v":0},null,null,{"$f":"H11/800","v":0},null,null,{"$f":"K11*30000","v":0}]
["Aktiviteter och upplevelser","AKTAKT0"]
["Aktiviteter och upplevelser","TURAKT0",null,null,110000,null,null,{"$f":"SUM(Tabell14[Lästa verksamhetspoäng per kurskod])","v":0},null,null,{"$f":"H13/800","v":0},null,null,{"$f":"K13*110000","v":0}]
["Aktivitetsledarskap","PEDAKI00S"]
["Akut omhändertagande","BEVAKU0",null,null,"Summa",null,null,{"$f":"SUM(H11:J14)","v":0},null,null,{"$f":"SUM(K11:M14)","v":0},null,null,{"$f":"SUM(N11:P14)","v":0}]
{"$rows_left_out":1004}
{"sheet":"1. Redovisning av elever","index":2,"n_rows":30,"n_cols":10,"rows_kept":30,"cut":false,"hidden":false,"merged":[[28,6,28,9],[29,6,34,9],[2,6,3,9],[9,6,9,9],[10,6,13,9],[14,6,21,9],[22,6,27,9]]}
["Kommun (valfri)","Personnummer","Kurskod","Lästa verksamhetspoäng"]
[]
[null,null,null,null,null,null,"Summering av redovisat statsbidrag visas nedan när du tryckt på Uppdatera alla under Data i menyn ovan"]
[]
[]
[null,null,null,null,null,null,"Typ av kurs (ersättningsnivå)","Summa verksamhetspoäng","Antal årsstudieplatser","Summa statsbidrag"]
[]
[null,null,null,null,null,null,"Summa",{"$f":"SUBTOTAL(109,sammanfattning[Summa verksamhetspoäng])","v":0},{"$f":"SUBTOTAL(109,sammanfattning[Antal årsstudieplatser])","v":0},{"$f":"SUBTOTAL(109,sammanfattning[Summa statsbidrag])","v":0}]
[]
[null,null,null,null,null,null,"Instruktioner"]
[null,null,null,null,null,null,"Kommun (valfri)\t \t \t \nNågra kommuner har efterfrågat en möjlighet att notera i blanketten vilken kommun som lämnat uppgifter om en elev. Denna uppgift är inte obligatorisk och ni avgör själva om ni vill skriva in kommuner i kolumn A.\n\n\n"]
[]
[]
[]
[null,null,null,null,null,null,"Personnummer\t \t \t \nI tabellen summeras bara korrekta personnummer. Personnummer som inte är korrekta dyker upp i flik 2 Kontroll personnummer kurskoder. Elever med tillfälliga personnummer rapporteras med födelsedatum och sedan TF20 för kvinna och TF10 för man, exempel: 19920427TF20. Det är även möjligt att rapportera andra TF-nummer.  Det viktiga är att siffran närmast F:et är udda om det är en man och jämn om det är en kvinna. Observera att elever med skyddade personuppgifter rapporteras i separat flik 0 Sekretesselever. \n\n\n\n\n"]
{"$rows_left_out":16}
{"sheet":"2. Kontroll personnr kurskod","index":3,"n_rows":6,"n_cols":10,"rows_kept":6,"cut":false,"hidden":false,"merged":[[3,9,3,11],[4,9,4,11],[5,9,12,11]]}
["Kommun (valfri)","Radnummer","Personnnummer","Kurskod","Korrekt personnummer","Korrekt kurskod","Korrekt angivna verksamhetspoäng","Avdragna poäng"]
[]
["Summa",null,null,null,null,null,null,{"$f":"SUBTOTAL(109,Fel[Avdragna poäng])","v":0}]
[null,null,null,null,null,null,null,null,null,"Instruktioner"]
[null,null,null,null,null,null,null,null,null,"Kontroll personnummer och kurskod"]
[null,null,null,null,null,null,null,null,null,"I tabellen visas personnummer som inte är korrekta, och även kurskoder som är felaktiga alternativt inte godkända enligt kurslistan för statsbidragsberättigade kurser. I kontrollen fångas det även upp om lästa verksamhetspoäng är angivna i fel format eller om värdet är tomt. Om personnumret, kurskoden och/eller verksamhetspoäng dyker upp som Nej i listan så har verksamhetspoängen inte summerats för eleven i fråga. Det felaktiga uppgifterna måste korrigeras i flik 1 Redovisning av elever innan poängen räknas med. Efter att korrigering av felaktiga uppgifter gjorts i flik 1, gå till menyn och tryck på Data och sedan Uppdatera alla (eller den röda knappen nedan). När felet/felen är korrigerade så kommer eleven att försvinna från flik 2.  "]

{"sheet":"3. Kontroll begränsning kurser","index":4,"n_rows":5,"n_cols":13,"rows_kept":5,"cut":false,"hidden":false,"merged":[[2,12,2,14],[3,12,3,14],[4,12,38,14]]}
["Personnummer","Summa lästa verksamhetspoäng","summa_poäng_orientering_modersmål","summa_poäng_orientering_övriga","Avdrag_poäng_orienteringskurser_modersmål","Avdrag_poäng_orienteringskurser_övriga","Poäng_orienteringskurser_avdrag_totalt","Summa vissa kurser","Vissa kurser andel av lästa poäng","Avdrag vissa kurser","Särskilda skäl tillämpat"]
[]
["Summa",null,null,null,{"$f":"SUBTOTAL(109,Elevblad[Avdrag_poäng_orienteringskurser_modersmål])","v":0},{"$f":"SUBTOTAL(109,Elevblad[Avdrag_poäng_orienteringskurser_övriga])","v":0},{"$f":"SUBTOTAL(109,Elevblad[Poäng_orienteringskurser_avdrag_totalt])","v":0},null,null,{"$f":"SUBTOTAL(109,Elevblad[Avdrag vissa kurser])","v":0},null,null,"Instruktioner"]
[null,null,null,null,null,null,null,null,null,null,null,null,"Kontroll begränsningar kurser"]
[null,null,null,null,null,null,null,null,null,null,null,null,"I tabellen visas elever som har läst för många poäng i orienteringskurser respektive kurser i vissa ämnen. I tabellen visas även hur många poäng som kommer dras av ert redovisade belopp om uppgifterna inte korrigeras i flik 1 Redovisning av elever. Efter att korrigering av orienteringskurser och/eller kurser i vissa ämnen gjorts i flik 1, gå till menyn och tryck på Data och sedan Uppdatera alla (eller den röda knappen nedan). Om ni korrigerar uppgifterna så kommer eleven att försvinna från flik 3.  Se villkor för orienteringskurser respektive kurser i vissa ämnen nedan. \n\nOrienteringskurser\t \t \t \t \nEn orienteringskurs ska motsvara behov som inte finns i en nationell kurs. Kurskoder för orienteringskurserna finns längst ner i kurslistan.\n\nEn elev får läsa högst 400 poäng i orienteringskurser, varav maximalt 200 poäng får avse orienteringskurser som syftar till att ge modersmålsstöd/studiehandledning på modersmål och högst 200 poäng får avse andra orienteringskurser\n\nSumman av lästa orienteringskurser per elev visas i kolumn C respektive kolumn D. Har ni redovisat över 200 poäng i orienteringskurser för modersmålsstöd/studiehandledning på modersmål och/eller mer än 200 poäng i andra orienteringskurser för en elev, kommer Skolverket att räkna bort poäng i handläggningen av er redovisning (se kolumn E och F).\n\t\nKurser i vissa ämnen\t \t \t \t\nKurser i vissa ämnen avser i denna blankett kurser i svenska, svenska som andraspråk, engelska, matematik och samhällskunskap. Dessa kurser ska vara på gymnasial nivå.\n\nKurser i vissa ämnen får högst bestå av 25 procent av en elevs utbildning.\n\nAndel vissa kurser visas i kolumn I. Är siffran högre än 25 procent kan Skolverket komma att räkna bort poäng i er redovisning (se kolumn J) om det inte finns giltiga skäl. Vi kommer skicka ut en komplettering för de elever som läst mer än 25 procent där ni får möjlighet att ange varför eleven läst mer än den tillåtna maxgränsen i vissa ämnen."]

{"sheet":"4. Anpassad utbildning","index":5,"n_rows":58,"n_cols":14,"rows_kept":58,"cut":false,"hidden":false,"merged":[[22,4,22,15],[23,4,29,15],[16,4,18,9],[16,10,18,14],[10,4,11,6],[10,7,11,9],[10,10,11,12],[10,13,11,15],[12,4,12,6],[12,7,12,9],[12,10,12,12],[12,13,12,15],[8,4,9,6],[8,7,9,9],[8,10,9,12],[8,13,9,15],[4,4,5,15],[6,4,7,6],[6,7,7,9],[6,10,7,12],[6,13,7,15]]}
["Ämne","Ämneskod","Lästa verksamhetspoäng per ämne"]
["Administration","ADI",null,null,null,"Summering av redovisat statsbidrag visas nedan när du tryckt på Uppdatera alla under Data i menyn ovan"]
["Bageri- och konditorikunskap","BAE"]
["Barnet i förskolan","BAR"]
["Biologi – naturbruk","BIA",null,null,"Summering anpassad utbildning"]
["Bygg och anläggning","BYO"]
["Digital skapande","DII",null,null,"Ersättningsnivå",null,null,"Totalt lästa verksamhetspoäng",null,null,"Antal årsstudieplatser",null,null,"Statsbidrag"]
["Entreprenörskap","ENR"]
["Estetisk kommunikation","ESI",null,null,"Orienteringskurser (30 000)",null,null,{"$f":"SUM(Tabell5[Kolumn3])","v":0},null,null,{"$f":"H9/800","v":0},null,null,{"$f":"K9*30000","v":0}]
["Fastighetsskötsel","FAT"]
["Fordonsbranschen","FOB",null,null,"Yrkesämne (110 000)",null,null,{"$f":"SUM(Tabell10[Lästa verksamhetspoäng per ämne])","v":0},null,null,{"$f":"H11/800","v":0},null,null,{"$f":"K11*110000","v":0}]
["Fordonsteknik","FON"]
["Fordonsvård","FOS",null,null,"Summa",null,null,{"$f":"SUM(H9:J12)","v":0},null,null,{"$f":"SUM(K9:M12)","v":0},null,null,{"$f":"SUM(N9:P12)","v":0}]
["Form och design","FOC"]
["Fotografisk bild","FOA"]
{"$rows_left_out":44}
{"sheet":"5. Övriga uppgifter","index":6,"n_rows":44,"n_cols":23,"rows_kept":44,"cut":false,"hidden":false,"merged":[[16,0,17,13],[42,1,43,12],[19,1,40,12],[0,0,1,13],[3,1,4,12],[5,1,6,3],[5,4,6,6],[8,1,10,12],[12,1,13,3],[12,4,13,6]]}
["Redovisning arbetsplats och handledare"]
[null,null,null,null,null,null,null,null,null,null,null,null,null,null,null,null,null,null,"Årsstudieplatser","Sekretesselever","Särskild utbildning","Totalt","Maxbelopp arbetsgivare"]
[null,null,null,null,null,null,null,null,null,null,null,null,null,null,null,null,null,null,{"$f":"sammanfattning[[#Totals],[Antal årsstudieplatser]]","v":0},{"$f":"'0. Sekretesselever'!K15","v":0},{"$f":"'4. Anpassad utbildning'!K13","v":0},{"$f":"SUM(S3:U3)","v":0},{"$f":"ROUNDDOWN(V3*40000,0)","v":0}]
[null,"Statsbidrag lämnas med högst 40 000 kronor per årsstudieplats för ersättning till arbetsplatsen. "]
[]
[null,"Fyll i redovisat belopp för ersättning till arbetsplatsen"]
[]
[]
[null,"Statsbidrag lämnas med högst 3 500 kronor för varje handledare som fullföljt en handledarutbildning och tagit emot en elev på arbetsplatsen. Bidrag lämnas enbart för handledare som bidrag itne lämnats för tidigare."]
[]
[]
[]
[null,"Fyll i redovisat belopp för handledarutbildning",null,null,0]
[]
[]
{"$rows_left_out":30}
{"sheet":"6. Sammanställning redovisning","index":7,"n_rows":100,"n_cols":8,"rows_kept":100,"cut":false,"hidden":false,"merged":[[66,1,66,4],[66,6,66,9],[100,1,107,9],[67,1,68,9],[71,0,72,10],[74,1,77,9],[80,1,87,9],[90,1,97,9],[99,1,99,9],[58,1,59,3],[58,4,59,6],[58,7,59,9],[60,1,61,3],[60,4,61,6],[60,7,61,9],[56,1,57,3],[56,4,57,6],[56,7,57,9],[28,1,29,4],[28,6,29,9],[31,1,32,4],[31,6,32,9],[37,1,38,9],[40,1,42,9],[44,0,44,10],[46,1,49,9],[54,1,55,3],[54,4,55,6],[54,7,55,9],[51,1,52,4],[51,6,52,9],[16,1,17,4],[16,6,17,9],[20,1,21,4],[20,6,21,9],[24,1,25,4],[24,6,25,9],[12,1,13,4],[12,6,13,9],[0,0,1,10],[4,1,5,4],[4,6,5,9],[8,1,9,4],[8,6,9,9]]}
["Summering av er redovisning"]
[]
[]
[]
[null,"Ange huvudsökande kommun",null,null,null,null,"Huvudsökande"]
[]
[]
[]
[null,"Beviljat belopp",null,null,null,null,{"$f":"VLOOKUP(G5,'Sammanställning ansökan'!A:B,2,FALSE)","v":"Beviljat belopp"}]
[]
[]
[]
[null,"Redovisat belopp i fliken\n1. Redovisning av elever",null,null,null,null,{"$f":"IFERROR(sammanfattning[[#Totals],[Summa statsbidrag]],\"\")","v":0}]
[]
[]
{"$rows_left_out":86}
{"sheet":"Sammanställning ansökan","index":8,"n_rows":41,"n_cols":19,"rows_kept":41,"cut":false,"hidden":false,"merged":[]}
["Huvudsökande","Beviljat belopp","Antal samverkande kommuner","Kommun 1","Kommun 2","Kommun 3","Kommun 4","Kommun 5","Kommun 6","Kommun 7","Kommun 8","Kommun 9","Kommun 10","Kommun 11","Kommun 12","Kommun 13","Kommun 14","Kommun 15","Kommun 16"]
["ALVESTA KOMMUN",10789763,7,"ALVESTA KOMMUN","LJUNGBY KOMMUN","MARKARYDS KOMMUN","ÄLMHULTS KOMMUN","VÄXJÖ KOMMUN","LESSEBO KOMMUN","UPPVIDINGE KOMMUN"]
["BORLÄNGE KOMMUN",13483000,15,"BORLÄNGE KOMMUN","AVESTA KOMMUN","FALU KOMMUN","GAGNEFS KOMMUN","HEDEMORA KOMMUN","LEKSANDS KOMMUN","LUDVIKA KOMMUN","MALUNG-SÄLENS KOMMUN","MORA KOMMUN","ORSA KOMMUN","RÄTTVIKS KOMMUN","SMEDJEBACKENS KOMMUN","SÄTERS KOMMUN","VANSBRO KOMMUN","ÄLVDALENS KOMMUN"]
["BORÅS KOMMUN",5375000,8,"BORÅS KOMMUN","BOLLEBYGDS KOMMUN","HERRLJUNGA KOMMUN","MARKS KOMMUN","SVENLJUNGA KOMMUN","TRANEMO KOMMUN","VÅRGÅRDA KOMMUN","ULRICEHAMNS KOMMUN"]
["ESKILSTUNA KOMMUN",1767500,6,"ESKILSTUNA KOMMUN","FLENS KOMMUN","GNESTA KOMMUN","KATRINEHOLMS KOMMUN","STRÄNGNÄS KOMMUN","VINGÅKERS KOMMUN"]
["ESLÖVS KOMMUN",7023000,12,"ESLÖVS KOMMUN","BURLÖVS KOMMUN","HÖRBY KOMMUN","HÖÖRS KOMMUN","KÄVLINGE KOMMUN","LOMMA KOMMUN","LUNDS KOMMUN","MALMÖ KOMMUN","STAFFANSTORPS KOMMUN","SVEDALA KOMMUN","TRELLEBORGS KOMMUN","VELLINGE KOMMUN"]
["FAGERSTA KOMMUN",1815000,3,"FAGERSTA KOMMUN","NORBERGS KOMMUN","SKINNSKATTEBERGS KOMMUN"]
["GISLAVEDS KOMMUN",5594666,4,"GISLAVEDS KOMMUN","GNOSJÖ KOMMUN","VÄRNAMO KOMMUN","VAGGERYDS KOMMUN"]
["GÄVLE KOMMUN",6890000,5,"GÄVLE KOMMUN","OCKELBO KOMMUN","ÄLVKARLEBY KOMMUN","HOFORS KOMMUN","SANDVIKENS KOMMUN"]
["GÖTEBORGS KOMMUN",28664250,13,"GÖTEBORGS KOMMUN","ALE KOMMUN","HÄRRYDA KOMMUN","KUNGSBACKA KOMMUN","KUNGÄLVS KOMMUN","LILLA EDETS KOMMUN","LERUMS KOMMUN","MÖLNDALS KOMMUN","PARTILLE KOMMUN","STENUNGSUNDS KOMMUN","TJÖRNS KOMMUN","ÖCKERÖ KOMMUN","ALINGSÅS KOMMUN"]
["HALMSTADS KOMMUN",7252000,5,"HALMSTADS KOMMUN","LAHOLMS KOMMUN","HYLTE KOMMUN","FALKENBERGS KOMMUN","VARBERGS KOMMUN"]
["HELSINGBORGS KOMMUN",5070000,11,"HELSINGBORGS KOMMUN","BJUVS KOMMUN","BÅSTADS KOMMUN","HÖGANÄS KOMMUN","KLIPPANS KOMMUN","LANDSKRONA KOMMUN","PERSTORPS KOMMUN","SVALÖVS KOMMUN","ÄNGELHOLMS KOMMUN","ÅSTORPS KOMMUN","ÖRKELLJUNGA KOMMUN"]
["HUDIKSVALLS KOMMUN",3715756,3,"HUDIKSVALLS KOMMUN","LJUSDALS KOMMUN","OVANÅKERS KOMMUN"]
["HULTSFREDS KOMMUN",4081204,3,"HULTSFREDS KOMMUN","VÄSTERVIKS KOMMUN","VIMMERBY KOMMUN"]
["Hälsinglands Utbildningsförbund",4324000,3,"NORDANSTIGS KOMMUN","SÖDERHAMNS KOMMUN","BOLLNÄS KOMMUN"]
{"$rows_left_out":27}
{"sheet":"7. EU-medel","index":9,"n_rows":15,"n_cols":6,"rows_kept":15,"cut":false,"hidden":false,"merged":[[12,1,13,2],[12,4,13,5],[0,2,0,5],[1,0,1,6],[4,1,4,4],[6,1,6,4],[8,1,8,4],[10,1,10,4]]}
[null,null,"Statsbidrag för regional yrkesinriktad vuxenutbildning delfinansierades av EU-medel under bidragsåret 2023. "]
["Insamling av samtliga aktörer som bedrivit utbildning finansierad av Lärlingsvux kombination under år 2023"]
[]
[]
[null,"För 2020-2023 har Skolverket tilldelats EU-medel som delfinansierar statsbidrag (2016:937) för regional yrkesinriktad vuxenutbildning. \n\nSkolverket samlar in uppgifter från er för att sedan rapportera vidare till Ekonomistyrningsverket och Europeiska kommissionen. Enligt 36 § tredje stycket i förordning (2016:937) ska ni lämna sådan ekonomisk och annan redovisning som Ekonomistyrningsverket och Europeiska kommissionen begär."]
[]
[null,"Skolverket behöver rapporter in samltiga aktörer som bedrivit utbildning inom regionalt yrkesvux under 2023. I den här fliken ska ni fylla i information om upphandlad utbildning samt information om kommuner/kommunalförbund som bedrivit utbildning i egen regi."]
[]
[null,"Vänstra tabellen\nI vänstra tabellen ska du fylla i de utbildningsanordnare som ni, eller kommuner i er samverkansgrupp, har upphandlat utbildning från. Har ni upphandlat utbildning från en annan kommun så ska den kommunen fyllas i som utbildningsanordnare."]
[]
[null,"Högra tabellen\nI högra tabellen ska ni fylla i de kommuner/kommunalförbund i ert samverkansområde som bedrivit utbildning i egen regi."]
[]
[null,"Fyll i samtliga utbildningsanordnare från vilka ni, eller kommuner i er samverkansgrupp, \nhar upphandlat utbildning från. \nUtbildningen ska ha bekostats av statsbidraget för Lärlingsvux kombination.",null,null,"Fyll i samtliga kommuner/kommunalförbund i er samverkansgrupp som bedrivit \nutbildning i egen regi. \nUtbildningen ska ha bekostats av statsbidraget för Lärlingsvux kombination."]
[]
[null,"Namn på utbildningsanordnare","Organisationsnummer för utbildningsanordnare",null,"Namn på kommun/kommunalförbund som bedrivit utbildning i egen regi","Organisationsnummer för kommunen/kommunalförbundet"]
{"$rows_left_out":1}
{"sheet":"Kurslista","index":10,"n_rows":1030,"n_cols":6,"rows_kept":1030,"cut":false,"hidden":false,"merged":[[1005,1,1005,5]]}
[]
[]
[]
[null,"Kurslista - Statsbidrag för regional yrkesinriktad vuxenutbildning",null,null,null,"Uppdaterad 2023-12-20"]
[]
[null,"Kurser inom kommunal vuxenutbildning som berättigar till statsbidrag för regional yrkesinriktad vuxenutbildning"]
[]
[null,"Kursnamn","Kurskod","Poäng","Ämne","Statsbidrag per årsstudieplats"]
[null,"Administration – specialisering","ADMADM00S",100,"Administration",110000]
[null,"Administration 1","ADMADM01",100,"Administration",110000]
[null,"Administration 2","ADMADM02",100,"Administration",110000]
[null,"Personaladministration","ADMPER0",100,"Administration",110000]
[null,"Receptions- och konferensservice","ADMREC0",100,"Administration",110000]
[null,"Affärskommunikation","AFFAFÄ00S",100,"Affärskommunikation",110000]
[null,"Aktiviteter och upplevelser","AKTAKT0",100,"Aktiviteter och värdskap",110000]
{"$rows_left_out":1016}
{"sheet":"Dubblettkontroll","index":11,"n_rows":9,"n_cols":11,"rows_kept":9,"cut":false,"hidden":true,"merged":[]}
["Kommun (valfri)","Personnummer","Kurskod","Lästa verksamhetspoäng","Merged.Väljåtgärd"]
[null,null,null,null,null,null,"1.","Sökväg kompletteringssvar",null,null,"Summa avdrag poäng för dubbletter"]
[]
[]
[null,null,null,null,null,null,"2."]
[]
[]
[]
[null,null,null,null,null,null,"3."]

{"sheet":"Kontrollog","index":12,"n_rows":8,"n_cols":3,"rows_kept":8,"cut":false,"hidden":true,"merged":[]}
["Kontroller","Arbetsblad","Utfall"]
["Intygande kombinationsutbildningar","5. Övriga uppgifter"]
["EU-rapportering","7. EU-medel"]
["Uppdatering / redovisat belopp","6. Sammanställning redovisning"]
["Inte angivit antal elever med sekretess","0. Sekretesselever"]
["Inte angivit antal elever med särskild utbildning","4. Särskild utbildning"]
["Felaktiga personnmr eller kurskoder","2. Kontroll personnr kurskod"]
["Begränsning kurser","3. Kontroll begränsning kurser"]

{"sheet":"Särskilda skäl","index":13,"n_rows":3,"n_cols":1,"rows_kept":3,"cut":false,"hidden":true,"merged":[]}
["Särskilda skäl"]
["JA"]
["NEJ"]

{"sheet":"kurslista låst","index":14,"n_rows":1022,"n_cols":8,"rows_kept":1022,"cut":false,"hidden":true,"merged":[]}
["Kursnamn","Kurskod","Poäng","Ämne","Statsbidrag ersättning årsstudieplats\nYrkesvux ","Statsbidrag_årsstudieplats_lärlingsvux","Statsbidrag_årsstudieplats_kombination","antal_tecken"]
["Administration – specialisering","ADMADM00S",100,"Administration",35000,50000,110000,6]
["Administration 1","ADMADM01",100,"Administration",35000,50000,110000,6]
["Administration 2","ADMADM02",100,"Administration",35000,50000,110000,6]
["Administration av nätverks- och serverutrustning","NAIADM0",100,"Nätverksteknik",75000,50000,110000,6]
["Administration av nätverks- och serverutrustning","NÄVADM0",100,"Nätverksteknik",75000,50000,110000,6]
["Aerodynamik","YRKAER0",100,"Yrkesteknik – flyg",75000,50000,110000,6]
["Aerodynamik","FLYAER0",100,"Flygyrkesteknik",75000,50000,110000,6]
["Affärsjuridik","JURAFF0",100,"Juridik",35000,50000,110000,6]
["Affärskommunikation","AFFAFÄ00S",100,"Affärskommunikation",35000,50000,110000,6]
["Affärsutveckling och ledarskap","HANAFR0",100,"Handel",35000,50000,110000,6]
["Aktiviteter och upplevelser","AKTAKT0",100,"Aktiviteter och värdskap",35000,50000,110000,6]
["Aktiviteter och upplevelser","TURAKT0",100,"Turism",35000,50000,110000,6]
["Aktivitetsledarskap","PEDAKI00S",100,"Pedagogik",35000,50000,110000,6]
["Akut omhändertagande","BEVAKU0",100,"Brand, bevakning och säkerhet",35000,50000,110000,6]
{"$rows_left_out":1008}
{"sheet":"parametrar","index":15,"n_rows":7,"n_cols":3,"rows_kept":7,"cut":false,"hidden":true,"merged":[]}
["Parametrar"]
["parameter","Bidrag_per_plats","värde"]
["statsbidrag_30000",30000,{"$f":"Tabell19[[#This Row],[Bidrag_per_plats]]/800","v":37.5}]
["statsbidrag_35000",35000,{"$f":"Tabell19[[#This Row],[Bidrag_per_plats]]/800","v":43.75}]
["statsbidrag_50000",50000,{"$f":"Tabell19[[#This Row],[Bidrag_per_plats]]/800","v":62.5}]
["statsbidrag_75000",75000,{"$f":"Tabell19[[#This Row],[Bidrag_per_plats]]/800","v":93.75}]
["statsbidrag_110000",110000,{"$f":"Tabell19[[#This Row],[Bidrag_per_plats]]/800","v":137.5}]